بارگنج تهویه‌ای
type: Concept
broader: بارگنج
preferred label: ventilated container @en
scope note: بارگُنجی که در دیواره‌های انتهایی آن روزنه‌هایی برای ورود و خروج هوا تعبیه شده است.

بارگنج
type: Concept
narrower: بارگنج تهویه‌ای
preferred label: container @en