ظرف شیشه‌ای
type: Concept
broader: ظرف
preferred label: glass container @en
scope note: ‌هریک از محصولات شیشه‌ای، مانند بطری و پارچ

ظرف
type: Concept
narrower: ظرف شیشه‌ای
preferred label: container (general) @en