بال
type: Concept
preferred label: wing @en
related: مخزن نوک بال

مخزن نوک بال
type: Concept
broader: مخزن سوخت هواگرد
preferred label: wingtip tank @en
related: بال
scope note: مخزن بیرونی سوخت پرتاب‌شونده یا ناپرتاب‌شونده که در نوک بال قرار دارد.

مخزن سوخت هواگرد
type: Concept
narrower: مخزن نوک بال
preferred label: aircraft fuel tank @en