مخزن سوخت کشتی
type: Concept
broader: مخزن سوخت
preferred label: bunker tank @en
related: کشتی
scope note: هریک از محفظه‌هایی که در زیر عرشۀ کشتی برای نگهداری و ذخیرۀ سوخت تعبیه می‌شود.

مخزن سوخت
type: Concept
narrower: مخزن سوخت کشتی
preferred label: fuel tank @en

کشتی
type: Concept
preferred label: ship @en
related: مخزن سوخت کشتی