مخزن جداساز
type: Concept
broader: مخزن
preferred label: interceptor tank @en
related: فاضلاب
scope note: مخزنی چندخانه برای جلوگیری از ورود آلاینده‌ها به سامانۀ فاضلاب که در چند مرحله آلاینده‌ها را جذب می‌کند.

مخزن
type: Concept
narrower: مخزن جداساز
preferred label: tank (container) @en

فاضلاب
type: Concept
preferred label: wastewater @en
related: مخزن جداساز