حوض هوادهی
type: Concept
broader: حوض فاضلاب
preferred label: aeration tank @en
scope note: مخزنی که در آن فاضلاب یا مایعی دیگر هوادهی می‌شود.

حوض فاضلاب
type: Concept
narrower: حوض هوادهی
preferred label: sewage tank @en