پیمان بازپرداخت هزینه
type: Concept
broader: قرارداد
preferred label: cost-reimbursable contract @en
scope note: پیمانی که براساس آن خریدار باید هزینه‌های فروشنده را طبق توافق بپردازد.

قرارداد
type: Concept
narrower: پیمان بازپرداخت هزینه
preferred label: contract @en