پیمان فهرست‌بها
type: Concept
broader: قرارداد
preferred label: unit rate contract @en
scope note: پیمانی که براساس آن نحوۀ پرداخت کارهای انجام‌شده فهرستی از بهای واحد اقلام است.

قرارداد
type: Concept
narrower: پیمان فهرست‌بها
preferred label: contract @en