سامانه فرماندهی و نظارت جهانی
type: Concept
broader: سامانه فرماندهی و نظارت
preferred label: global command and control system @en
scope note: سامانۀ فرماندهی و نظارت قابلِ‌‌اعزام که نیروهای خودی را در عملیات مشترک و چندملیتی در سراسر گسترۀ عملیات نظامی با به‌کارگیری سامانه‌های ارتباطی سازگار و تعامل‌پذیر و یکپارچه پشتیبانی می‌کند.

سامانه فرماندهی و نظارت
type: Concept
narrower: سامانه فرماندهی و نظارت جهانی
preferred label: command and control system @en