سرمایش بی‌دررو
type: Concept
broader: سرمایش
preferred label: adiabatic cooling @en
scope note: کاهش دمای سامانه بدون تبادل گرما با محیط پیرامون

سرمایش
type: Concept
narrower: سرمایش بی‌دررو
preferred label: cooling @en