خوردگی جوی
type: Concept
broader: خوردگی
preferred label: atmospheric corrosion @en
related: هواشناسی
scope note: تخریب تدریجی مواد در نتیجۀ تماس با عوامل موجود در جوّ، مانند اکسیژن و کربن‌دی‌اکسید و بخار آب و ترکیبات گوگرد و کلر

خوردگی
type: Concept
narrower: خوردگی جوی
preferred label: corrosion @en

هواشناسی
type: Concept
preferred label: meteorology @en
related: خوردگی جوی