خوردگی قلیایی
type: Concept
alternative label: حمله قلیایی
broader: خوردگی
preferred label: caustic corrosion @en
related: پوش‌رنگ مقاوم‌به‌قلیا
scope note: خوردگی لوله‌های دیگ‌های بخار ناشی از وجود مقدار زیادی سدیم‌هیدروکسید

خوردگی
type: Concept
narrower: خوردگی قلیایی
preferred label: corrosion @en

پوش‌رنگ مقاوم‌به‌قلیا
type: Concept
preferred label: alkali-resistant paint @en
related: خوردگی قلیایی