خوردگی شیمیایی
type: Concept
broader: خوردگی
preferred label: chemical corrosion @en
scope note: نوعی خوردگی که تحت تأثیر گازهای خشک یا در محیط مواد آلی عاری از آب که طبیعتی غیرالکتروشیمیایی دارند، ایجاد می‌شود.

خوردگی
type: Concept
narrower: خوردگی شیمیایی
preferred label: corrosion @en