خوردگی آتشی ـ دودی
type: Concept
broader: خوردگی
preferred label: fire and smoke corrosion @en
scope note: نوعی خوردگی که براثر واکنش شیمیایی میان گازهای حاصل از احتراق و لایۀ محافظ اکسیدی آلیاژهای فلزی در نقاطی که در معرض آتش و دود هستند، رخ می‌دهد.

خوردگی
type: Concept
narrower: خوردگی آتشی ـ دودی
preferred label: corrosion @en