خوردگی فاز گازی
type: Concept
alternative label: خوردگی جوّکاهشی
broader: خوردگی موضعی
preferred label: gas phase corrosion @en
scope note: نوعی خوردگی موضعی که غالباً در نتیجۀ واکنش احیایی مستقیم در نیروگاه‌های سوخت فسیلی که در معرض گازهای محیطی حاوی گوگرد یا رسوبات حاوی پیریت‌های آهنی هستند، رخ می‌دهد.

خوردگی موضعی
type: Concept
narrower: خوردگی فاز گازی
preferred label: localized corrosion @en