خوردگی نایکنواخت
type: Concept
broader: خوردگی موضعی
preferred label: nonuniform corrosion @en
scope note: نوعی خوردگی موضعی که در نواحی کوچک فلز به وجود می‌آید.

خوردگی موضعی
type: Concept
narrower: خوردگی نایکنواخت
preferred label: localized corrosion @en