خوردگی زردزخمی
type: Concept
broader: خوردگی موضعی
preferred label: ringworm corrosion @en
scope note: نوعی خوردگی موضعی در دیوارۀ لوله‌های نفت خام براثر شیو حرارتی و حملۀ عوامل خورندۀ محیطی در مجاورت فلز

خوردگی موضعی
type: Concept
narrower: خوردگی زردزخمی
preferred label: localized corrosion @en