رویینش آندی
type: Concept
broader: رویینش
preferred label: anodic passivation @en
scope note: رویین‌سازی فلز وقتی‌که در برق‌کاف مناسب به‌صورت آندی قطبیده شود.

رویینش
type: Concept
narrower: رویینش آندی
preferred label: passivation @en