رمزنگاری با کلید عمومی
type: Concept
alternative label: رمزنگاری نامتقارن
broader: رمزنگاری
preferred label: public key cryptography @en
scope note: روشی برای رمزگذاری پیام که در آن از کلید عمومی و کلید مخفی استفاده می‌شود: کلید عمومی برای رمزگذاری و کلید مخفی برای رمزگشایی

رمزنگاری
type: Concept
narrower: رمزنگاری با کلید عمومی
preferred label: cryptography @en