رمزنگاری کوانتومی
type: Concept
broader: رمزنگاری
preferred label: quantum cryptography @en
scope note: رمزنگاری با استفاده از قوانین مکانیک کوانتومی

رمزنگاری
type: Concept
narrower: رمزنگاری کوانتومی
preferred label: cryptography @en