رمزنگاری آستانه‌ای پیش‌نگر
type: Concept
broader: رمزنگاری آستانه‌ای
preferred label: proactive threshold cryptography @en
scope note: نوعی طرح رمزنگاری که با استفاده از توابع رمزنگاری مختلف، کارسازان را قادر می‌سازد سهم جدید خود را از کلید مخفی با مشارکت یکدیگر و بدون افشای کلید مخفی محاسبه کنند.

رمزنگاری آستانه‌ای
type: Concept
narrower: رمزنگاری آستانه‌ای پیش‌نگر
preferred label: threshold cryptography @en