آمپرولت‌سنجی چرخه‌ای کم‌دامنه
type: Concept
broader: آمپرولت‌سنجی چرخه‌ای
preferred label: small-amplitude cycle voltammetry @en
scope note: فنی برای اندازه‌گیری مقاومت به خوردگی و قطبش

آمپرولت‌سنجی چرخه‌ای
type: Concept
narrower: آمپرولت‌سنجی چرخه‌ای کم‌دامنه
preferred label: cyclic voltammetry @en