خدمات اَبری داده
type: Concept
alternative label: خاد
broader: داده
preferred label: data as a service @en
scope note: نوعی خدمات ویژه در بعضی از محیط‌های اَبری که امکان دسترسی به داده‌های باارزش و متفاوتی را فراهم می‌کند.

داده
type: Concept
narrower: خدمات اَبری داده
preferred label: data @en