داده‌های استخراجی
type: Concept
broader: داده
preferred label: extracted data @en
scope note: داده‌هایی خاص که از یک پروندۀ داده‌ای جدا و بیرون کشیده شده باشد.

داده
type: Concept
narrower: داده‌های استخراجی
preferred label: data @en