امنیت داده
type: Concept
preferred label: data security @en
related: داده‌های حفاظت‌شده

داده‌های حفاظت‌شده
type: Concept
broader: داده
preferred label: protected data @en
related: امنیت داده
scope note: اطلاعاتی در یک سامانه که در برابر دستیابی غیرمُجاز به داده‌ها و تغییر عمدی یا سهوی آنها به‌طور ناخواسته یا به دلیل خطاهای کاربری و خرابی‌های رایانه‌ای محافظت شده باشد.

داده
type: Concept
narrower: داده‌های حفاظت‌شده
preferred label: data @en