داده شطرنجی
type: Concept
broader: داده
preferred label: raster data @en
scope note: داده‌هایی با ساختار شبکه‌ای خانکی مرکب از شبکه‌های سطری و ستونی

داده
type: Concept
narrower: داده شطرنجی
preferred label: data @en