داده‌های بازنموده
type: Concept
broader: داده
preferred label: represented data @en
related: بازنمود داده‌ها
scope note: داده‌های ارائه‌شده در قالب‌هایی چون نمودار وجدول و اعداد

داده
type: Concept
narrower: داده‌های بازنموده
preferred label: data @en

بازنمود داده‌ها
type: Concept
preferred label: data representation @en
related: داده‌های بازنموده