داده‌برداری دوسوگسترش
type: Concept
broader: داده‌برداری
preferred label: split spread data acquisition @en
scope note: داده‌برداری لرزه‌ای با قرار دادن چشمه در وسط پروفیل لرزه‌ای

داده‌برداری
type: Concept
narrower: داده‌برداری دوسوگسترش
preferred label: data acquisition @en