داده‌برداری کلی
type: Concept
broader: داده‌برداری
preferred label: total data acquisition @en
scope note: نوعی داده‌برداری که در آن تمامی واحد نمونه در یک جامعۀ آماری بررسی می‌شود.

داده‌برداری
type: Concept
narrower: داده‌برداری کلی
preferred label: data acquisition @en