داده‌گواری
type: Concept
broader: داده‌پردازی
preferred label: data assimilation @en
scope note: تلفیق داده‌های ناهمگون، نمونه‌برداری‌شده در زمان‌ها و بازه‌های زمانی متفاوت و در مکان‌های مختلف، برای توصیف یکدست و سازگار سامانه‌ای فیزیکی مانند جوّ

داده‌پردازی
type: Concept
narrower: داده‌گواری
preferred label: data processing @en