داده‌پیرایی
type: Concept
broader: داده‌پردازی
preferred label: data cleansing @en
scope note: فرایند تصحیح خطاهای داده‌ای در مجموعه‌ای از داده‌ها، برای بالا بردن کیفیت داده‌ها با توجه به اهداف خاص

داده‌پردازی
type: Concept
narrower: داده‌پیرایی
preferred label: data processing @en