چکیده‌سازی داده‌ها
type: Concept
broader: داده‌پردازی
preferred label: data compaction @en
scope note: کاهش پهنای باند و هزینه و زمان و شمار عناصر داده‌ای برای ایجاد و ارسال و ذخیره‌سازی، بدون از دست دادن اطلاعات اصلی که با از میان بردن حشو و زوائد یا استفاده از رمزگذاری ویژه انجام می‌شود.

داده‌پردازی
type: Concept
narrower: چکیده‌سازی داده‌ها
preferred label: data processing @en