برگردانی داده‌ها
type: Concept
broader: داده‌پردازی
preferred label: data conversion @en
scope note: تغییر رمزبندی داده‌ها از صورتی به صورت دیگر

داده‌پردازی
type: Concept
narrower: برگردانی داده‌ها
preferred label: data processing @en