اکتشاف داده‌ها
type: Concept
broader: داده‌پردازی
preferred label: data exploration @en
scope note: فرایند جست‌وجو و تحلیل مقدماتی یک دادگان برای تعیین محتوای اطلاعاتی آن

داده‌پردازی
type: Concept
narrower: اکتشاف داده‌ها
preferred label: data processing @en