استخراج داده‌ها
type: Concept
broader: داده‌پردازی
preferred label: data extraction @en
scope note: جدا کردن و بیرون کشیدن داده‌هایی خاص از یک پروندۀ داده‌ای

داده‌پردازی
type: Concept
narrower: استخراج داده‌ها
preferred label: data processing @en