داده‌های گروه‌بندی‌شده
type: Concept
preferred label: grouped data @en
related: گروه‌بندی داده‌ها

گروه‌بندی داده‌ها
type: Concept
broader: داده‌پردازی
preferred label: data grouping @en
related: داده‌های گروه‌بندی‌شده
scope note: دسته‌بندی مجموعه‌ای از داده‌ها براساس کاربرد و کارکرد آنها

داده‌پردازی
type: Concept
narrower: گروه‌بندی داده‌ها
preferred label: data processing @en