ارتباطات داده‌ای
type: Concept
preferred label: data communications @en
related: لایه پیوند داده‌ای

لایه پیوند داده‌ای
type: Concept
broader: داده‌پردازی
preferred label: data link layer @en
related: ارتباطات داده‌ای
scope note: دومین لایه در مدل اتصال متقابل سامانه‌های باز که در ارتباطات داده‌ای به کار می‌رود و گردهم‌آوری پیام‌ها و هماهنگ‌سازی گردش آنها در آن انجام می‌شود.

داده‌پردازی
type: Concept
narrower: لایه پیوند داده‌ای
preferred label: data processing @en