داده‌بانی پیوسته
type: Concept
alternative label: حفاظت پیوسته داده‌ها
broader: حفاظت داده‌ها
preferred label: continuous data protection @en
scope note: نوعی سامانۀ پشتیبان‌گیری که از داده‌های جاری کاربر یک نسخۀ بدل ایجاد می‌کند.

حفاظت داده‌ها
type: Concept
narrower: داده‌بانی پیوسته
preferred label: data protection @en