بخش‌بندی داده‌ها
type: Concept
broader: داده‌پردازی
preferred label: data sectioning @en
scope note: تقسیم مجموعه‌ای از داده‌ها به چند زیرمجموعه برای اِعمال فرایندهای خاص روی آنها

داده‌پردازی
type: Concept
narrower: بخش‌بندی داده‌ها
preferred label: data processing @en