جاری‌سازی داده
type: Concept
alternative label: جریان داده
broader: داده‌پردازی
preferred label: data streaming @en
scope note: انتقال داده‌های دوگانی به‌صورت زنجیره‌ای پیوسته

داده‌پردازی
type: Concept
narrower: جاری‌سازی داده
preferred label: data processing @en