دررفتگی لبه‌ای
type: Concept
broader: دررفتگی (بلور)
preferred label: edge dislocation @en
scope note: نوعی ناراستی خطی که در آن مرز میان نواحی لغزیده و نالغزیده در داخل بلور عمود بر راستای صفحۀ لغزش است.

دررفتگی (بلور)
type: Concept
narrower: دررفتگی لبه‌ای
preferred label: dislocation (crystal) @en