کنترل یخ
type: Concept
preferred label: ice control @en
related: برفک‌زدایی

برفک‌زدایی
type: Concept
alternative label: برفک‌زدا
preferred label: defrosting @en
related: کنترل یخ
related: یخچال
scope note: ذوب کردن یخ و برفک تشکیل‌شده بر روی قسمت سردکنندۀ یخ‌زن‌ها

یخچال
type: Concept
preferred label: refrigerator @en
related: برفک‌زدایی