پوشانش پرده‌ای
type: Concept
broader: فن پوشانش
preferred label: curtain coating @en
scope note: یکی از روش‌های پوشانش سطح با رزین یا محلول یا تعلیق یا نامیزۀ رقیق که در آن، زیرآیند (substrate) به‌صورت عمود بر پرده یا آبشاری فروریزنده، از آن عبور می‌کند؛ آهنگ شارش مایع فروریز و سرعت خطی زیرآیند بر ضخامت پوشش تأثیر می‌گذارد.

فن پوشانش
type: Concept
narrower: پوشانش پرده‌ای
preferred label: coating technique @en