آب‌کاری براق
type: Concept
broader: آب‌کاری
preferred label: bright plating @en
scope note: نوعی آب‌کاری که در نتیجۀ آن سطحی صاف و براق و بی‌نیاز از پرداخت به دست می‌آید.

آب‌کاری
type: Concept
narrower: آب‌کاری براق
preferred label: electroplating @en