نازک‌آب‌کاری
type: Concept
broader: آب‌کاری
preferred label: flash plating @en
scope note: نشاندن لایۀ نهایی بسیار نازک به روش آب‌کاری

آب‌کاری
type: Concept
narrower: نازک‌آب‌کاری
preferred label: electroplating @en