پوشانش پودری
type: Concept
broader: فن پوشانش
preferred label: powder coating @en
related: پودر پوشانش
scope note: یکی از روش‌های پوشانش مادۀ پوششی که در آن از رنگدانه و پیوندۀ جامد استفاده و در طی آن، پیوندۀ جامد براثر گرما ذوب می‌شود و پس از سرد شدن، پوشش رنگ‌دانه‌دار پدید می‌آید.

فن پوشانش
type: Concept
narrower: پوشانش پودری
preferred label: coating technique @en

پودر پوشانش
type: Concept
preferred label: powder coatings @en
related: پوشانش پودری