افشانش بادی
type: Concept
broader: پوشانش افشانه‌ای
preferred label: air spray @en
related: هوای فشرده
scope note: نوعی پوشانش افشانه‌ای که در آن مادۀ پوششی براثر اختلاط با هوای فشرده بسیار ریز می‌شود.

پوشانش افشانه‌ای
type: Concept
narrower: افشانش بادی
preferred label: spray coating @en

هوای فشرده
type: Concept
preferred label: compressed air @en
related: افشانش بادی