نهشت الکتروکوچی
type: Concept
broader: نهشت
preferred label: electrophoretic deposition @en
scope note: فرایند پوشانش ذرات رنگ باردار معلق در محلول رسانا که در آن ذرات با برقراری جریان مستقیم بر سطح دارای بار مخالف نشانده می‌شوند.

نهشت
type: Concept
narrower: نهشت الکتروکوچی
preferred label: deposition @en