نرم‌افزار رایانه‌ای
type: Concept
preferred label: computer software @en
related: طراحی پایین‌به‌بالا

طراحی پایین‌به‌بالا
type: Concept
broader: طراحی
preferred label: bottom-up design @en
related: نرم‌افزار رایانه‌ای
scope note: فرایندی در طراحی سامانۀ رایانه‌ای که از ابتدایی‌ترین و جزئی‌ترین مؤلفه‌ها آغاز می‌شود تا به سطوح بالاتری از مؤلفه‌ها، متشکل از مؤلفه‌های کوچک‌تر، برسد.

طراحی
type: Concept
narrower: طراحی پایین‌به‌بالا
preferred label: design @en