طراحی مفهومی سامانه
type: Concept
alternative label: طراحی مفهومی
broader: طراحی
preferred label: conceptual system design @en
scope note: 1. گونه‌ای طراحی سامانۀ رایانه‌ای که براساس مشخصات منطقی سامانه صورت می‌گیرد 2. در داده‌پردازی، طراحی یک فرایند یا سامانۀ واپایش فرایند به‌نحوی‌که به‌ اهداف مورد نظر برسند.

طراحی
type: Concept
narrower: طراحی مفهومی سامانه
preferred label: design @en